{"text_format":"1","workbook":"xlsx","n_sheets":4,"sheets":["FORMULIR","WILAYAH","DATA KELUARGA","MASTER"],"not_rendered":{"charts":0,"images":1,"macros":1,"external_links":1,"defined_names":13,"comments":0,"pivot_tables":0},"unopened":[],"bounds":{"document_bytes":16777216,"sheet_cells":100000,"rows_first":2000,"rows_last":500,"rows_between":2000,"halvings":0,"cell_chars":16384,"cell_head_chars":4096},"cells_cut":0,"cells_raw":0,"read":"whole","date_system":"1900"}

{"sheet":"FORMULIR","index":0,"n_rows":203,"n_cols":58,"rows_kept":203,"cut":false,"hidden":true,"merged":[[202,51,202,55],[43,49,43,57],[16,2,16,17],[194,2,194,5],[199,2,199,3],[27,29,27,38],[27,40,27,42],[27,44,27,47],[52,11,52,14],[52,16,52,19],[52,32,52,35],[52,37,52,40],[23,29,23,38],[24,29,24,37],[24,38,25,38],[23,40,24,42],[16,50,16,51],[18,2,18,17],[20,2,20,17],[23,2,24,5],[23,7,24,8],[23,10,24,16],[27,2,27,5],[27,7,27,8],[1,45,1,47],[1,49,1,57],[5,2,6,17],[5,19,6,45],[5,56,6,57],[5,47,6,54],[1,19,1,20],[1,25,1,26],[1,28,1,31],[1,33,1,35],[1,37,1,38],[1,21,1,24],[1,40,1,43],[3,19,3,20],[3,22,3,23],[3,25,3,26],[3,49,3,57],[3,28,3,31],[3,33,3,35],[3,37,3,38],[3,40,3,43],[3,45,3,47],[7,19,7,45],[7,47,7,54],[14,50,14,51],[12,50,12,51],[10,50,10,51],[8,50,8,51],[8,53,8,54],[10,53,10,54],[12,53,12,54],[8,19,8,45],[10,19,10,45],[12,19,12,45],[14,19,14,45],[8,47,8,48],[10,47,10,48],[35,55,35,57],[37,55,37,57],[8,56,8,57],[16,53,16,54],[18,53,18,54],[14,56,14,57],[29,55,29,57],[31,55,31,57],[20,47,20,48],[24,47,25,47],[23,44,23,47],[20,50,20,51],[20,19,20,45],[18,19,18,45],[18,50,18,51],[24,27,25,27],[23,18,23,27],[24,18,24,26],[27,10,27,16],[27,18,27,27],[10,2,10,17],[12,2,12,17],[16,19,16,45],[39,55,39,57],[14,2,14,17],[7,2,7,17],[18,56,18,57],[27,55,27,57],[12,47,12,48],[14,47,14,48],[16,56,16,57],[8,2,8,17],[16,47,16,48],[18,47,18,48],[25,49,25,57],[20,53,20,54],[20,56,20,57],[24,44,24,46],[7,56,7,57],[12,56,12,57],[10,56,10,57],[14,53,14,54],[95,42,96,44],[95,2,96,14],[45,1,46,1],[45,2,46,21],[95,1,96,1],[49,6,49,7],[54,12,54,13],[54,17,54,18],[54,33,54,34],[54,38,54,39],[70,2,70,3],[70,7,70,8],[49,17,49,18],[95,39,96,41]]}
[null,null,null,null,null,null,null,null,null,null,null,null,null,null,null,null,null,null,null,null,null,null,null,null,null,null,null,null,null,null,null,null,null,null,null,null,null,null,null,null,null,null,null,null,null,null,null,null,null,null,null,null,null,null,null,null,null,"F/I/PK/15"]
[null,"DATA KELUARGA",null,null,null,null,null,null,null,null,null,null,null,null,null,null,null,null,null,"Provinsi",null,"Kab/Kota",null,null,null,"Kec.",null,null,"Desa/Kelurahan",null,null,null,null,"Dusun/RW",null,null,null,"RT",null,null,"No. Rumah / Rumah Tangga",null,null,null,null,"No. Urut Keluarga",null,null,null,"Nomor Kendali Referensi"]
[]
[null,"I. KEPENDUDUKAN",null,null,null,null,null,null,null,null,null,null,null,null,null,null,null,null,null,"31","31",null,"72","72",null,"01","01",null,"1001","1001","1001","1001",null,"006","","",null,"015","",null,"",null,null,null,null,"",null,null,null,""]
[]
[null,null,"NIK",null,null,null,null,null,null,null,null,null,null,null,null,null,null,null,null,"NAMA",null,null,null,null,null,null,null,null,null,null,null,null,null,null,null,null,null,null,null,null,null,null,null,null,null,null,null,"TANGGAL LAHIR",null,null,null,null,null,null,null,null,"UMUR"]
[]
[null,null,"(1)",null,null,null,null,null,null,null,null,null,null,null,null,null,null,null,null,"(2)",null,null,null,null,null,null,null,null,null,null,null,null,null,null,null,null,null,null,null,null,null,null,null,null,null,null,null,"(3)",null,null,null,null,null,null,null,null,"(4)"]
[null,1,"",null,null,null,null,null,null,null,null,null,null,null,null,null,null,null,null,"",null,null,null,null,null,null,null,null,null,null,null,null,null,null,null,null,null,null,null,null,null,null,null,null,null,null,null,"",null,"/","",null,"/","",null,null,{"$f":"IF(BB9<>\"\",MASTER!$E$2-BB9,\"\")","v":""}]
[]
[null,2,"",null,null,null,null,null,null,null,null,null,null,null,null,null,null,null,null,"",null,null,null,null,null,null,null,null,null,null,null,null,null,null,null,null,null,null,null,null,null,null,null,null,null,null,null,"",null,"/","",null,"/","",null,null,{"$f":"IF(BB11<>\"\",MASTER!$E$2-BB11,\"\")","v":""}]
[]
[null,3,"",null,null,null,null,null,null,null,null,null,null,null,null,null,null,null,null,null,null,null,null,null,null,null,null,null,null,null,null,null,null,null,null,null,null,null,null,null,null,null,null,null,null,null,null,"",null,"/","",null,"/","",null,null,{"$f":"IF(BB13<>\"\",MASTER!$E$2-BB13,\"\")","v":""}]
[]
[null,4,"",null,null,null,null,null,null,null,null,null,null,null,null,null,null,null,null,"",null,null,null,null,null,null,null,null,null,null,null,null,null,null,null,null,null,null,null,null,null,null,null,null,null,null,null,"",null,"/","",null,"/","",null,null,{"$f":"IF(BB15<>\"\",MASTER!$E$2-BB15,\"\")","v":""}]
[]
[null,5,"",null,null,null,null,null,null,null,null,null,null,null,null,null,null,null,null,"",null,null,null,null,null,null,null,null,null,null,null,null,null,null,null,null,null,null,null,null,null,null,null,null,null,null,null,"",null,"/","",null,"/","",null,null,{"$f":"IF(BB17<>\"\",MASTER!$E$2-BB17,\"\")","v":""}]
[]
[null,6,"",null,null,null,null,null,null,null,null,null,null,null,null,null,null,null,null,null,null,null,null,null,null,null,null,null,null,null,null,null,null,null,null,null,null,null,null,null,null,null,null,null,null,null,null,"",null,"/","",null,"/","",null,null,{"$f":"IF(BB19<>\"\",MASTER!$E$2-BB19,\"\")","v":""}]
[]
{"$rows_left_out":184}
{"sheet":"WILAYAH","index":1,"n_rows":232,"n_cols":6,"rows_kept":232,"cut":false,"hidden":false,"merged":[]}
["KODE PROVINSI","KODE KAB KOTA","KODE KECAMATAN","KODE KELURAHAN","KODE RW","KODE RT"]
["31","72","01","1001","001","001"]
["31","72","01","1001","001","002"]
["31","72","01","1001","001","003"]
["31","72","01","1001","001","004"]
["31","72","01","1001","001","005"]
["31","72","01","1001","001","006"]
["31","72","01","1001","001","007"]
["31","72","01","1001","001","008"]
["31","72","01","1001","001","009"]
["31","72","01","1001","001","010"]
["31","72","01","1001","002","001"]
["31","72","01","1001","002","002"]
["31","72","01","1001","002","003"]
["31","72","01","1001","002","004"]
["31","72","01","1001","002","005"]
["31","72","01","1001","002","006"]
["31","72","01","1001","002","007"]
["31","72","01","1001","002","008"]
["31","72","01","1001","002","009"]
{"$rows_left_out":213}
{"sheet":"DATA KELUARGA","index":2,"n_rows":318,"n_cols":137,"rows_kept":318,"cut":false,"hidden":false,"merged":[]}
[null,"NomorKendali","KodeProvinsi","KodeKabupaten","KodeKecamatan","KodeKelurahan","KodeRW","KodeRT","NomorRumah","NomorUrut","NomorKendaliReferensi","NIK1","Nama1","TanggalLahir1","BulanLahir1","TahunLahir1","HubunganDenganKK1","JenisKelamin1","Agama1","Pendidikan1","Pekerjaan1","StatusKawin1","JKN1","NIK2","Nama2","TanggalLahir2","BulanLahir2","TahunLahir2","HubunganDenganKK2","JenisKelamin2","Agama2","Pendidikan2","Pekerjaan2","StatusKawin2","JKN2","NIK3","Nama3","TanggalLahir3","BulanLahir3","TahunLahir3","HubunganDenganKK3","JenisKelamin3","Agama3","Pendidikan3","Pekerjaan3","StatusKawin3","JKN3","NIK4","Nama4","TanggalLahir4","BulanLahir4","TahunLahir4","HubunganDenganKK4","JenisKelamin4","Agama4","Pendidikan4","Pekerjaan4","StatusKawin4","JKN4","NIK5","Nama5","TanggalLahir5","BulanLahir5","TahunLahir5","HubunganDenganKK5","JenisKelamin5","Agama5","Pendidikan5","Pekerjaan5","StatusKawin5","JKN5","NIK6","Nama6","TanggalLahir6","BulanLahir6","TahunLahir6","HubunganDenganKK6","JenisKelamin6","Agama6","Pendidikan6","Pekerjaan6","StatusKawin6","JKN6","NIK7","Nama7","TanggalLahir7","BulanLahir7","TahunLahir7","HubunganDenganKK7","JenisKelamin7","Agama7","Pendidikan7","Pekerjaan7","StatusKawin7","JKN7","UsiaKawinPertamaSuami","UsiaKawinPertamaIstri","AnakDilahirkanHidupLakiLaki","AnakDilahirkanHidupPerempuan","AnakMasihHidupLakiLaki","AnakMasihHidupPerempuan","StatusPUS","KesertaanBerKB","MetodeKontrasepsi","LamaKBTahun","LamaKBBulan","InginPunyaAnakLagi","AlasanTidakBerKB","TempatPelayananKB","PK1","PK2","PK3","PK4","PK5","PK6","PK7","PK8","PK9","PK10","PK11","PK12","PK13","PK14","PK15","PK16","PK17","PK18","PK19","PK20","PK21","PK22","PK23","PK24","PK25","PK26","PK27","PK28"]
["HAPUS","00252975","31","72","01","1001","006","012","0002","001",null,"3172011311480002","MUHAMMAD SAIMIN","13","11","1948",1,1,1,3,6,2,4,"3172015503630006","BENCA DEWANI","15","03","1963",2,0,1,3,9,2,4,"","","","","",null,null,null,null,null,null,null,"","","","","",null,null,null,null,null,null,null,"","","","","",null,null,null,null,null,null,null,"","","","","",null,null,null,null,null,null,null,"","","","","",null,null,null,null,null,null,null,25,16,2,2,2,2,0,"3",null,null,null,"3","8",null,1,1,1,1,1,1,3,1,1,1,1,1,3,3,3,3,2,2,1,1,1,1,1,1,1,2,18,2]
["HAPUS","00252976","31","72","01","1001","006","012","0003","002","","3172011805890006","SURYA DARMA","18","05","1989",1,1,1,7,5,2,1,"3173036206910005","DESSY","22","06","1991",2,0,1,7,9,2,1,"3172011210111009","OXELLIO DHEFIRST EXEMP","12","10","2011",3,1,1,10,10,1,1,"","","","","",null,null,null,null,null,null,null,"","","","","",null,null,null,null,null,null,null,"","","","","",null,null,null,null,null,null,null,"","","","","",null,null,null,null,null,null,null,22,20,1,0,1,0,1,"1","3",4,0,"2",null,"14",1,1,1,1,1,1,3,1,1,1,1,1,1,1,3,3,3,2,4,1,1,1,1,1,1,2,18,3]
["HAPUS","00252977","31","72","01","1001","006","012","0007","003","","3173021612730004","KUN ING","18","12","1973",1,1,5,6,5,2,4,"3173026906790005","SURYA SARI","29","06","1979",2,0,5,6,9,2,4,"3173021502010001","JHON KEVIN","10","02","2001",3,1,5,5,10,1,4,"3172012310070005","JHON STEVEN","23","10","2007",3,1,5,4,10,1,4,"3172016601121002","CELINA FALISHA","26","01","2012",3,0,5,10,10,1,4,"","","","","",null,null,null,null,null,null,null,"","","","","",null,null,null,null,null,null,null,25,24,2,1,2,1,1,"1","3",1,1,"3",null,"7",1,1,1,1,1,1,1,1,1,1,1,2,1,2,2,2,3,2,2,1,1,1,1,1,1,2,18,5]
["HAPUS","00252978","31","72","01","1001","006","012","0003","004","","3172011809890002","ROSON","18","09","1975",1,1,4,6,5,1,4,"3172016004570003","TAN KIAN","20","04","1985",4,0,4,5,9,3,4,"","","","","",null,null,null,null,null,null,null,"","","","","",null,null,null,null,null,null,null,"","","","","",null,null,null,null,null,null,null,"","","","","",null,null,null,null,null,null,null,"","","","","",null,null,null,null,null,null,null,null,null,null,null,null,null,0,null,null,null,null,null,null,null,1,1,1,1,1,1,3,1,1,1,1,2,3,3,3,3,3,2,2,1,1,1,1,1,1,2,18,2]
["HAPUS","00252979","31","72","01","1001","006","012","0002","005","","3172011104650004","SUGRIAN","11","04","1965",1,1,1,3,6,2,3,"3172014206670001","WARGUMI YATI","02","06","1967",2,0,1,3,9,2,3,"3172012506670001","SUNOKO","25","06","1987",3,1,1,7,9,1,3,"","","","","",null,null,null,null,null,null,null,"","","","","",null,null,null,null,null,null,null,"","","","","",null,null,null,null,null,null,null,"","","","","",null,null,null,null,null,null,null,24,21,1,0,1,0,1,"1","7",0,1,"3",null,"14",1,1,1,1,1,1,3,2,1,1,1,1,3,3,3,3,3,2,2,1,1,1,1,1,1,2,18,3]
["HAPUS","00252980","31","72","01","1001","006","012","0021","006","","3172011407650001","JUMALI","14","07","1965",1,1,1,7,5,2,2,"3172016004740003","TITIN SUTINAH","20","04","1974",2,0,1,7,9,2,2,"3172010910960003","FADELIA UTAMI","09","10","1996",3,0,1,7,10,1,2,"3172010601010001","MUAMMARRAFI MUKTIWIGUNA","06","01","2001",3,1,1,4,10,1,2,"3172015204060006","MAULINA PUTRI ARJANTI","12","04","2006",3,0,1,2,10,1,2,"","","","","",null,null,null,null,null,null,null,"","","","","",null,null,null,null,null,null,null,30,20,1,2,1,2,1,"1","3",5,0,"3",null,"14",1,1,1,1,1,1,1,1,1,1,1,1,3,3,2,2,3,2,4,1,1,1,1,1,1,2,18,5]
["HAPUS","00252981","31","72","01","1001","006","012","0001","007","","3172015210640011","EK JONG","02","10","1964",1,1,5,5,5,2,4,"3172010412850005","TONI ARIANTO","04","02","1985",2,0,5,5,9,2,4,"3172011906910011","JUNAIDI","19","06","1991",3,1,5,6,5,1,4,"","","","","",null,null,null,null,null,null,null,"","","","","",null,null,null,null,null,null,null,"","","","","",null,null,null,null,null,null,null,"","","","","",null,null,null,null,null,null,null,24,22,1,0,1,0,1,"1","6",3,0,"3",null,"14",1,1,1,1,1,1,3,1,1,1,2,2,3,3,2,2,3,2,2,1,1,1,1,4,1,2,18,3]
["HAPUS","00252982","31","72","01","1001","006","012","0018","008","","3172012207670004","MULADI SURJA","22","07","1967",1,1,5,7,5,2,4,"3172015109710003","LENA","11","09","1971",2,0,5,7,9,2,4,"3172012804000001","ERIC ASTRADA","28","03","2000",3,1,5,4,10,1,4,"3172010603060001","ALEX ASTRADA","21","06","2002",3,1,5,3,10,1,4,"3172016105131003","METTA ASTRADA","16","02","2012",3,0,5,10,10,1,4,"","","","","",null,null,null,null,null,null,null,"","","","","",null,null,null,null,null,null,null,28,28,2,1,2,1,1,"1","6",3,0,"3",null,"14",1,1,1,1,1,1,1,1,1,1,1,1,1,1,1,1,3,2,2,1,1,1,1,1,1,2,18,5]
["HAPUS","00252983","31","72","01","1001","006","012","0004","009","","3172011112740001","ROMADHON","11","12","1974",1,1,1,7,5,2,4,"3172016607790002","SITI TASDIKOH","26","07","1979",2,0,1,7,9,2,4,"3172011303000002","MUHAMMAD DZIKRY ARDIASYAH","13","03","2000",3,1,1,6,10,1,4,"3172010605071006","MUHAMMAD RAFI MAYDITYA","06","05","2007",3,1,1,2,10,1,4,"","","","","",null,null,null,null,null,null,null,"","","","","",null,null,null,null,null,null,null,"","","","","",null,null,null,null,null,null,null,25,20,2,0,2,0,1,"3",null,null,null,"1","1",null,1,1,1,1,1,1,1,1,1,1,1,1,3,3,1,1,3,2,4,1,1,1,1,1,1,2,18,4]
["HAPUS","00252984","31","72","01","1001","006","012","0006","010","","3172010310841001","TUSWANTORO","03","10","1984",1,1,1,5,5,2,1,"3172014507860002","KRISNAWATI","05","07","1986",2,0,1,7,9,2,1,"3172011203121007","MARIO KAROMI","12","03","2012",3,1,1,10,10,1,1,"","","","","",null,null,null,null,null,null,null,"","","","","",null,null,null,null,null,null,null,"","","","","",null,null,null,null,null,null,null,"","","","","",null,null,null,null,null,null,null,25,23,1,0,1,0,1,"3",null,null,null,"1","8",null,1,1,1,1,1,1,3,1,1,1,1,2,1,2,3,3,3,2,4,1,1,1,1,1,1,2,18,3]
["HAPUS","00252985","31","72","01","1001","006","012","0009","011","","3172010106620006","AAN DJOHAN","01","06","1962",1,1,1,7,5,2,1,"3172015007670003","SRI HARTINI","10","07","1967",2,0,1,7,5,2,1,"3172011712950002","MUHAMMAD DENY ANDRIYAN","17","12","1995",3,1,1,7,10,1,1,"","","","","",null,null,null,null,null,null,null,"","","","","",null,null,null,null,null,null,null,"","","","","",null,null,null,null,null,null,null,"","","","","",null,null,null,null,null,null,null,31,26,1,0,1,0,1,"3",null,null,null,"3","8",null,1,1,1,1,1,1,3,1,1,1,1,2,3,3,1,1,3,2,4,1,1,1,1,1,1,2,18,3]
["HAPUS","00252986","31","72","01","1001","006","012","0008","012","","3172012404710003","SOEPARNO","24","04","1971",1,1,1,7,5,2,4,"3172014703710004","LISNAWATI","07","03","1971",2,0,1,7,9,2,4,"3172011407930006","ZULLIS EDI PRASETIA","17","07","1993",3,1,1,7,10,1,4,"3172014110981003","SITI FAUZIAH AZZAHRO","01","10","1998",3,0,1,6,10,1,4,"","","","","",null,null,null,null,null,null,null,"","","","","",null,null,null,null,null,null,null,"","","","","",null,null,null,null,null,null,null,23,23,1,1,1,1,1,"3",null,null,null,"3","8",null,1,1,1,1,1,1,1,1,1,1,1,2,3,3,1,1,3,2,4,4,1,1,1,1,1,2,18,4]
["HAPUS","00252987","31","72","01","1001","006","012","0007","013","","3172011904700003","SUTONO","19","04","1970",1,1,5,7,5,2,4,"3172015711740004","MINA","17","11","1974",2,0,5,7,9,2,4,"3172011104061001","DELVIAN SUTONO","11","04","1996",3,1,5,3,10,1,4,"3172011001091001","MARVEL SUTONO","10","01","1994",3,1,5,10,10,1,4,"","","","","",null,null,null,null,null,null,null,"","","","","",null,null,null,null,null,null,null,"","","","","",null,null,null,null,null,null,null,27,24,2,0,2,0,1,"1","7",0,1,"3",null,"7",1,1,1,1,1,1,1,1,1,1,1,2,3,3,1,2,3,2,2,1,1,1,1,1,1,2,18,4]
["HAPUS","00252988","31","72","01","1001","006","012","0016","014","","3172010308630011","RADIAN KOTIONO","03","08","1963",1,1,5,6,5,2,4,"3172016306600002","NURCIANI KOTIONO","13","06","1960",2,0,5,6,5,2,4,"","","","","",null,null,null,null,null,null,null,"","","","","",null,null,null,null,null,null,null,"","","","","",null,null,null,null,null,null,null,"","","","","",null,null,null,null,null,null,null,"","","","","",null,null,null,null,null,null,null,35,30,0,0,0,0,0,"3",null,null,null,"3","8",null,1,1,1,1,1,1,3,1,1,1,1,1,3,3,3,3,3,2,2,1,1,1,1,1,1,2,18,2]
["HAPUS","00252989","31","72","01","1001","006","012","0011","015","","3172016903620004","MARIANA","29","03","1962",1,0,5,5,6,2,4,"3172016208930002","JUNITA BERIANI","22","08","1993",3,0,5,5,10,1,4,"","","","","",null,null,null,null,null,null,null,"","","","","",null,null,null,null,null,null,null,"","","","","",null,null,null,null,null,null,null,"","","","","",null,null,null,null,null,null,null,"","","","","",null,null,null,null,null,null,null,null,null,1,2,1,2,0,"3",null,null,null,"3","8",null,1,1,1,1,1,1,3,1,1,1,1,2,3,3,1,2,3,2,4,1,1,1,1,1,1,2,18,2]
["HAPUS","00252990","31","72","01","1001","006","012","0002","016","","3172010311650004","SRI RIYADI","03","11","1965",1,1,1,4,5,2,1,"3172014511700006","MURTINI","05","11","1970",2,0,1,4,9,2,1,"3172014104930003","AYU ANITA SARI","01","04","1993",3,0,1,5,5,1,1,"3172012402030006","BAGUS FEBRIANSYA","24","02","2003",3,1,1,4,10,1,1,"","","","","",null,null,null,null,null,null,null,"","","","","",null,null,null,null,null,null,null,"","","","","",null,null,null,null,null,null,null,23,20,1,1,1,1,1,"1","3",0,3,"3",null,"6",1,1,1,1,1,1,1,1,1,1,1,1,3,3,1,2,3,2,2,1,1,1,1,1,1,2,18,4]
["HAPUS","00252991","31","72","01","1001","006","012","0005","017","","3172011004640003","HASANUDIN","10","04","1964",1,1,1,7,5,2,1,"3172014302740001","BEDADARI","03","02","1974",2,0,1,7,6,2,1,"3172016406020003","YUNITA PATRISIYAH","24","06","2002",3,0,1,6,10,1,1,"3172010409080003","RICHO SEPTIAN SIHOMBING","04","09","2008",3,1,1,4,10,1,1,"3172010702980001","HARIYANTO SIHOMBING","07","02","1998",3,1,1,2,10,1,1,"","","","","",null,null,null,null,null,null,null,"","","","","",null,null,null,null,null,null,null,24,22,2,1,2,1,1,"1","3",0,1,"3",null,"14",1,1,1,1,1,1,1,1,1,1,1,1,3,3,1,2,3,1,4,1,1,1,1,1,1,2,18,5]
["HAPUS","00252992","31","72","01","1001","006","012","0001","018","","3172011507770009","MARIJAN","15","07","1977",1,1,1,5,5,2,1,"3172015909840010","ILAH NURMILA","19","09","1984",2,0,1,5,9,2,1,"3172015009061002","KLARA PUTRI LESTARI","10","09","2006",3,0,1,2,10,1,1,"3172015211111002","NOVITA AULIA","12","11","2011",3,0,1,10,10,1,1,"","","","","",null,null,null,null,null,null,null,"","","","","",null,null,null,null,null,null,null,"","","","","",null,null,null,null,null,null,null,27,21,0,2,0,2,1,"1","3",4,0,"2",null,"14",1,1,1,1,1,1,1,1,1,1,1,2,1,2,3,3,3,2,4,1,1,1,1,1,1,2,18,4]
["HAPUS","00252993","31","72","01","1001","006","012","0021","019","","3172016309580001","MARSIH","23","09","1958",1,0,1,9,9,3,2,"","","","","",null,null,null,null,null,null,null,"","","","","",null,null,null,null,null,null,null,"","","","","",null,null,null,null,null,null,null,"","","","","",null,null,null,null,null,null,null,"","","","","",null,null,null,null,null,null,null,"","","","","",null,null,null,null,null,null,null,null,36,0,1,0,0,0,"3",null,null,null,"3","8",null,1,1,1,1,1,1,3,1,1,1,1,2,3,3,3,3,3,2,4,1,1,1,1,1,1,2,18,1]
{"$rows_left_out":299}
{"sheet":"MASTER","index":3,"n_rows":117,"n_cols":7,"rows_kept":117,"cut":false,"hidden":true,"merged":[]}
["TAHUN","TANGGAL","BULAN","TANDA X","PERIODE INI","TingkatWilayah","WilayahID"]
["1900","01","01","x",2015,4,2415]
["1901","02","02"]
["1902","03","03"]
["1903","04","04"]
["1904","05","05"]
["1905","06","06"]
["1906","07","07"]
["1907","08","08"]
["1908","09","09"]
["1909","10","10"]
["1910","11","11"]
["1911","12","12"]
["1912","13"]
["1913","14"]
["1914","15"]
["1915","16"]
["1916","17"]
["1917","18"]
["1918","19"]
{"$rows_left_out":97}